Reaction Details
TargetRibosomal protein S6 kinase alpha-3
LigandBDBM50381079
Substrate/Competitorn/a
Meas. Tech.ChEMBL_814151 (CHEMBL2020792)
IC50 1130±n/a nM
Citation Hilinski, MKMrozowski, RMClark, DELannigan, DA Analogs of the RSK inhibitor SL0101: optimization of in vitro biological stability. Bioorg Med Chem Lett22:3244-7 (2012) 
 
Ribosomal protein S6 kinase alpha-3
Name:Ribosomal protein S6 kinase alpha-3
Type:Serine/threonine-protein kinase
Mol. Mass.:83740.03
Organism:Homo sapiens (Human)
Description:The human RSK2 sequence differed from the Genbank entry NM_004586 at one residue, V45G. The protein was cloned and purified from baculovirus expression system.
Residue:740
BDBM50381079
NameBDBM50381079
Synonyms:CHEMBL2017517
TypeSmall organic molecule
Emp. Form.C27H30N2O12
Mol. Mass.574.5333
SMILESCCNC(=O)O[C@H]1[C@H](C)O[C@@H](Oc2c(O)c3c(cc(O)cc3=O)oc2-c2ccc(O)cc2)[C@H](O)[C@@H]1OC(=O)NCC