Reaction Details
TargetTyrosine-protein kinase SYK
LigandBDBM50381094
Substrate/Competitorn/a
Meas. Tech.ChEMBL_814174 (CHEMBL2020888)
IC50 185.6±n/a nM
Citation McLean, LRZhang, YZaidi, NBi, XWang, RDharanipragada, RJurcak, JGGillespy, TAZhao, ZMusick, KYChoi, YMBarrague, MPeppard, JSmicker, MDuguid, MParkar, AFordham, JKominos, D X-ray crystallographic structure-based design of selective thienopyrazole inhibitors for interleukin-2-inducible tyrosine kinase. Bioorg Med Chem Lett22:3296-300 (2012) 
 
Tyrosine-protein kinase SYK
Name:Tyrosine-protein kinase SYK
Type:Enzyme
Mol. Mass.:72079.99
Organism:Homo sapiens (Human)
Description:P43405
Residue:635
BDBM50381094
NameBDBM50381094
Synonyms:CHEMBL2017553
TypeSmall organic molecule
Emp. Form.C18H19N3OS
Mol. Mass.325.428
SMILESCCC(O)(CC)c1ccc2cc([nH]c2c1)-c1n[nH]c2ccsc12