Reaction Details
TargetTyrosine-protein kinase Lck
LigandBDBM50381094
Substrate/Competitorn/a
Meas. Tech.ChEMBL_814175 (CHEMBL2020889)
IC50 1101.3±n/a nM
Citation McLean, LRZhang, YZaidi, NBi, XWang, RDharanipragada, RJurcak, JGGillespy, TAZhao, ZMusick, KYChoi, YMBarrague, MPeppard, JSmicker, MDuguid, MParkar, AFordham, JKominos, D X-ray crystallographic structure-based design of selective thienopyrazole inhibitors for interleukin-2-inducible tyrosine kinase. Bioorg Med Chem Lett22:3296-300 (2012) 
 
Tyrosine-protein kinase Lck
Name:Tyrosine-protein kinase Lck
Type:n/a
Mol. Mass.:57987.83
Organism:Homo sapiens (Human)
Description:P06239
Residue:509
BDBM50381094
NameBDBM50381094
Synonyms:CHEMBL2017553
TypeSmall organic molecule
Emp. Form.C18H19N3OS
Mol. Mass.325.428
SMILESCCC(O)(CC)c1ccc2cc([nH]c2c1)-c1n[nH]c2ccsc12