Reaction Details
TargetTyrosine-protein kinase Lck
LigandBDBM50381097
Substrate/Competitorn/a
Meas. Tech.ChEMBL_814175 (CHEMBL2020889)
IC50 203.2±n/a nM
Citation McLean, LRZhang, YZaidi, NBi, XWang, RDharanipragada, RJurcak, JGGillespy, TAZhao, ZMusick, KYChoi, YMBarrague, MPeppard, JSmicker, MDuguid, MParkar, AFordham, JKominos, D X-ray crystallographic structure-based design of selective thienopyrazole inhibitors for interleukin-2-inducible tyrosine kinase. Bioorg Med Chem Lett22:3296-300 (2012) 
 
Tyrosine-protein kinase Lck
Name:Tyrosine-protein kinase Lck
Type:n/a
Mol. Mass.:57987.83
Organism:Homo sapiens (Human)
Description:P06239
Residue:509
BDBM50381097
NameBDBM50381097
Synonyms:CHEMBL2017557
TypeSmall organic molecule
Emp. Form.C24H23N3OS
Mol. Mass.401.524
SMILESCCC(O)(CC)c1ccc2cc([nH]c2c1)-c1n[nH]c2cc(sc12)-c1ccccc1