Reaction Details
TargetSerine/threonine-protein kinase PknB
LigandBDBM50381109
Substrate/Competitorn/a
Meas. Tech.ChEMBL_814187 (CHEMBL2020901)
IC50 1162±n/a nM
Citation Chapman, TMBouloc, NBuxton, RSChugh, JLougheed, KEOsborne, SASaxty, BSmerdon, SJTaylor, DLWhalley, D Substituted aminopyrimidine protein kinase B (PknB) inhibitors show activity against Mycobacterium tuberculosis. Bioorg Med Chem Lett22:3349-53 (2012) 
 
Serine/threonine-protein kinase PknB
Name:Serine/threonine-protein kinase PknB
Type:PROTEIN
Mol. Mass.:66497.93
Organism:Mycobacterium tuberculosis
Description:ChEMBL_774233
Residue:626
BDBM50381109
NameBDBM50381109
Synonyms:CHEMBL2017709
TypeSmall organic molecule
Emp. Form.C18H14FN5
Mol. Mass.319.3357
SMILESCc1cc(Nc2nc(nc3ccccc23)-c2ccc(F)cc2)[nH]n1