Reaction Details
TargetSerine/threonine-protein kinase PknB
LigandBDBM50381120
Substrate/Competitorn/a
Meas. Tech.ChEMBL_814187 (CHEMBL2020901)
IC50 84±n/a nM
Citation Chapman, TMBouloc, NBuxton, RSChugh, JLougheed, KEOsborne, SASaxty, BSmerdon, SJTaylor, DLWhalley, D Substituted aminopyrimidine protein kinase B (PknB) inhibitors show activity against Mycobacterium tuberculosis. Bioorg Med Chem Lett22:3349-53 (2012) 
 
Serine/threonine-protein kinase PknB
Name:Serine/threonine-protein kinase PknB
Type:PROTEIN
Mol. Mass.:66497.93
Organism:Mycobacterium tuberculosis
Description:ChEMBL_774233
Residue:626
BDBM50381120
NameBDBM50381120
Synonyms:CHEMBL2017721
TypeSmall organic molecule
Emp. Form.C16H22N6
Mol. Mass.298.3861
SMILESC1CC1c1cc(Nc2ccnc(NC3CCCCC3)n2)[nH]n1