Reaction Details
TargetSerine/threonine-protein kinase PknB
LigandBDBM50381125
Substrate/Competitorn/a
Meas. Tech.ChEMBL_814187 (CHEMBL2020901)
IC50 217±n/a nM
Citation Chapman, TMBouloc, NBuxton, RSChugh, JLougheed, KEOsborne, SASaxty, BSmerdon, SJTaylor, DLWhalley, D Substituted aminopyrimidine protein kinase B (PknB) inhibitors show activity against Mycobacterium tuberculosis. Bioorg Med Chem Lett22:3349-53 (2012) 
 
Serine/threonine-protein kinase PknB
Name:Serine/threonine-protein kinase PknB
Type:PROTEIN
Mol. Mass.:66497.93
Organism:Mycobacterium tuberculosis
Description:ChEMBL_774233
Residue:626
BDBM50381125
NameBDBM50381125
Synonyms:CHEMBL2017726
TypeSmall organic molecule
Emp. Form.C14H18N6
Mol. Mass.270.3329
SMILESC(Nc1nccc(Nc2cc(n[nH]2)C2CC2)n1)C1CC1