Reaction Details
TargetPhosphatidylinositol 4,5-bisphosphate 3-kinase catalytic subunit beta isoform
LigandBDBM50381159
Substrate/Competitorn/a
Meas. Tech.ChEMBL_814276 (CHEMBL2019373)
IC50 2±n/a nM
Citation Sanchez, RMErhard, KHardwicke, MALin, HMcSurdy-Freed, JPlant, RRaha, KRominger, CMSchaber, MDSpengler, MDMoore, MLYu, HLuengo, JITedesco, RRivero, RA Synthesis and structure-activity relationships of 1,2,4-triazolo[1,5-a]pyrimidin-7(3H)-ones as novel series of potentß isoform selective phosphatidylinositol 3-kinase inhibitors. Bioorg Med Chem Lett22:3198-202 (2012) 
 
Phosphatidylinositol 4,5-bisphosphate 3-kinase catalytic subunit beta isoform
Name:Phosphatidylinositol 4,5-bisphosphate 3-kinase catalytic subunit beta isoform
Type:Enzyme Subunit
Mol. Mass.:122769.00
Organism:Homo sapiens (Human)
Description:P42338
Residue:1070
BDBM50381159
NameBDBM50381159
Synonyms:CHEMBL2018217
TypeSmall organic molecule
Emp. Form.C18H19Cl2N5O2
Mol. Mass.408.282
SMILESCC1CN(CCO1)c1cc(=O)n2nc(C)n(Cc3cccc(Cl)c3Cl)c2n1