Reaction Details
TargetPhosphatidylinositol 4,5-bisphosphate 3-kinase catalytic subunit beta isoform
LigandBDBM50381161
Substrate/Competitorn/a
Meas. Tech.ChEMBL_814276 (CHEMBL2019373)
IC50 0.6±n/a nM
Citation Sanchez, RMErhard, KHardwicke, MALin, HMcSurdy-Freed, JPlant, RRaha, KRominger, CMSchaber, MDSpengler, MDMoore, MLYu, HLuengo, JITedesco, RRivero, RA Synthesis and structure-activity relationships of 1,2,4-triazolo[1,5-a]pyrimidin-7(3H)-ones as novel series of potentß isoform selective phosphatidylinositol 3-kinase inhibitors. Bioorg Med Chem Lett22:3198-202 (2012) 
 
Phosphatidylinositol 4,5-bisphosphate 3-kinase catalytic subunit beta isoform
Name:Phosphatidylinositol 4,5-bisphosphate 3-kinase catalytic subunit beta isoform
Type:Enzyme Subunit
Mol. Mass.:122769.00
Organism:Homo sapiens (Human)
Description:P42338
Residue:1070
BDBM50381161
NameBDBM50381161
Synonyms:CHEMBL2018219
TypeSmall organic molecule
Emp. Form.C19H20F3N5O2
Mol. Mass.407.3896
SMILESCc1nn2c(nc(cc2=O)N2CCOCC2)n1Cc1cccc(c1C)C(F)(F)F