Reaction Details
TargetPhosphatidylinositol 4,5-bisphosphate 3-kinase catalytic subunit gamma isoform
LigandBDBM50381162
Substrate/Competitorn/a
Meas. Tech.ChEMBL_814277 (CHEMBL2019374)
IC50 1600±n/a nM
Citation Sanchez, RMErhard, KHardwicke, MALin, HMcSurdy-Freed, JPlant, RRaha, KRominger, CMSchaber, MDSpengler, MDMoore, MLYu, HLuengo, JITedesco, RRivero, RA Synthesis and structure-activity relationships of 1,2,4-triazolo[1,5-a]pyrimidin-7(3H)-ones as novel series of potentß isoform selective phosphatidylinositol 3-kinase inhibitors. Bioorg Med Chem Lett22:3198-202 (2012) 
 
Phosphatidylinositol 4,5-bisphosphate 3-kinase catalytic subunit gamma isoform
Name:Phosphatidylinositol 4,5-bisphosphate 3-kinase catalytic subunit gamma isoform
Type:Enzyme Subunit
Mol. Mass.:126470.30
Organism:Homo sapiens (Human)
Description:P48736
Residue:1102
BDBM50381162
NameBDBM50381162
Synonyms:CHEMBL2018221
TypeSmall organic molecule
Emp. Form.C21H22F3N5O2
Mol. Mass.433.4269
SMILESCc1c(Cn2c(nn3c2nc(cc3=O)N2CCOCC2)C2CC2)cccc1C(F)(F)F