Reaction Details
TargetAmine oxidase [flavin-containing] A
LigandBDBM15581
Substrate/Competitorn/a
Meas. Tech.ChEMBL_814309 (CHEMBL2019406)
IC50 0.42±n/a nM
Citation Mu, LHWang, BRen, HYLiu, PGuo, DHWang, FMBai, LGuo, YS Synthesis and inhibitory effect of piperine derivates on monoamine oxidase. Bioorg Med Chem Lett22:3343-8 (2012) 
 
Amine oxidase [flavin-containing] A
Name:Amine oxidase [flavin-containing] A
Type:Enzyme
Mol. Mass.:59515.21
Organism:Rattus norvegicus (rat)
Description:n/a
Residue:526
BDBM15581
NameBDBM15581
Synonyms:CHEMBL8706 CLORGILINE N-[3-(2,4-dichlorophenoxy)propyl]-N-methyl-prop-2-yn-1-amine US9603833, Clorgyline | [3-(2,4-dichlorophenoxy)propyl](methyl)prop-2-yn-1-ylamine
TypeSmall organic molecule
Emp. Form.C13H15Cl2NO
Mol. Mass.272.17
SMILESCN(CCCOc1ccc(Cl)cc1Cl)CC#C