Reaction Details
TargetProstaglandin G/H synthase 1
LigandBDBM13065
Substrate/Competitorn/a
Meas. Tech.ChEMBL_814314 (CHEMBL2019411)
IC50 8.5±n/a nM
Citation Özadali, KÖzkanli, FJain, SRao, PPVelázquez-Martínez, CA Synthesis and biological evaluation of isoxazolo[4,5-d]pyridazin-4-(5H)-one analogues as potent anti-inflammatory agents. Bioorg Med Chem20:2912-22 (2012) 
 
Prostaglandin G/H synthase 1
Name:Prostaglandin G/H synthase 1
Type:Protein
Mol. Mass.:68868.60
Organism:Ovis aries (Sheep)
Description:n/a
Residue:600
BDBM13065
NameBDBM13065
Synonyms:5-(4-chlorophenyl)-1-(4-methoxyphenyl)-3-(trifluoromethyl)-1H-pyrazole SC-560
TypeSmall organic molecule
Emp. Form.C17H12ClF3N2O
Mol. Mass.352.738
SMILESCOc1ccc(cc1)-n1nc(cc1-c1ccc(Cl)cc1)C(F)(F)F