Reaction Details
TargetProstaglandin G/H synthase 2
LigandBDBM50381257
Substrate/Competitorn/a
Meas. Tech.ChEMBL_814315 (CHEMBL2019412)
IC50 2200±n/a nM
Citation Özadali, KÖzkanli, FJain, SRao, PPVelázquez-Martínez, CA Synthesis and biological evaluation of isoxazolo[4,5-d]pyridazin-4-(5H)-one analogues as potent anti-inflammatory agents. Bioorg Med Chem20:2912-22 (2012) 
 
Prostaglandin G/H synthase 2
Name:Prostaglandin G/H synthase 2
Type:Enzyme
Mol. Mass.:69003.89
Organism:Homo sapiens (Human)
Description:Recombinant Cox-2 provided by Cayman (Cayman Chemical Co.,Ann Arbor, MI).
Residue:604
BDBM50381257
NameBDBM50381257
Synonyms:CHEMBL2018674
TypeSmall organic molecule
Emp. Form.C19H20N6O3S
Mol. Mass.412.465
SMILESCCn1c(Cn2nc(Cc3ccc(OC)cc3)c3onc(C)c3c2=O)n[nH]c1=S