Reaction Details
TargetDNA (cytosine-5)-methyltransferase 1
LigandBDBM50009672
Substrate/Competitorn/a
Meas. Tech.ChEMBL_814365 (CHEMBL2019574)
IC50 941±n/a nM
Citation Hobley, GMcKelvie, JCHarmer, JEHowe, JOyston, PCRoach, PL Development of rationally designed DNA N6 adenine methyltransferase inhibitors. Bioorg Med Chem Lett22:3079-82 (2012) 
 
DNA (cytosine-5)-methyltransferase 1
Name:DNA (cytosine-5)-methyltransferase 1
Type:Enzyme
Mol. Mass.:183184.85
Organism:Homo sapiens (Human)
Description:P26358
Residue:1616
BDBM50009672
NameBDBM50009672
Synonyms:AdoHcy S-(5'-adenosyl)-L-homocysteine S-[1-(adenin-9-yl)-1,5-dideoxy-beta-D-ribofuranos-5-yl]-L-homocysteine SAH US9175331, 1 | US9333217, S-Adenosyl-L-homocysteine (SAH)
TypeSmall organic molecule
Emp. Form.C14H20N6O5S
Mol. Mass.384.411
SMILESN[C@@H](CCSC[C@H]1O[C@H]([C@H](O)[C@@H]1O)n1cnc2c(N)ncnc12)C(O)=O