Reaction Details
TargetCarbonic anhydrase 12
LigandBDBM50028962
Substrate/Competitorn/a
Meas. Tech.ChEMBL_814447 (CHEMBL2019843)
Ki 7330±n/a nM
Citation Balboni, GCongiu, COnnis, VMaresca, AScozzafava, AWinum, JYMaietti, ASupuran, CT Flavones and structurally related 4-chromenones inhibit carbonic anhydrases by a different mechanism of action compared to coumarins. Bioorg Med Chem Lett22:3063-6 (2012) 
 
Carbonic anhydrase 12
Name:Carbonic anhydrase 12
Type:Enzyme
Mol. Mass.:39456.00
Organism:Homo sapiens (Human)
Description:Catalytic domain of human cloned isozyme was used in the assay
Residue:354
BDBM50028962
NameBDBM50028962
Synonyms:CHEMBL275638 | flavone
TypeSmall organic molecule
Emp. Form.C15H10O2
Mol. Mass.222.2387
SMILESO=c1cc(oc2ccccc12)-c1ccccc1