Reaction Details
TargetCarbonic anhydrase 2
LigandBDBM50381322
Substrate/Competitorn/a
Meas. Tech.ChEMBL_814442 (CHEMBL2019838)
IC50 9430±n/a nM
Citation Balboni, GCongiu, COnnis, VMaresca, AScozzafava, AWinum, JYMaietti, ASupuran, CT Flavones and structurally related 4-chromenones inhibit carbonic anhydrases by a different mechanism of action compared to coumarins. Bioorg Med Chem Lett22:3063-6 (2012) 
 
Carbonic anhydrase 2
Name:Carbonic anhydrase 2
Type:Enzyme
Mol. Mass.:29250.71
Organism:Homo sapiens (Human)
Description:P00918
Residue:260
BDBM50381322
NameBDBM50381322
Synonyms:CHEMBL2019136
TypeSmall organic molecule
Emp. Form.C15H11NO2
Mol. Mass.237.2533
SMILESNc1oc2ccccc2c(=O)c1-c1ccccc1