Reaction Details
TargetCarbonic anhydrase 1
LigandBDBM50381324
Substrate/Competitorn/a
Meas. Tech.ChEMBL_814440 (CHEMBL2019836)
IC50 9070±n/a nM
Citation Balboni, GCongiu, COnnis, VMaresca, AScozzafava, AWinum, JYMaietti, ASupuran, CT Flavones and structurally related 4-chromenones inhibit carbonic anhydrases by a different mechanism of action compared to coumarins. Bioorg Med Chem Lett22:3063-6 (2012) 
 
Carbonic anhydrase 1
Name:Carbonic anhydrase 1
Type:Enzyme
Mol. Mass.:28873.37
Organism:Homo sapiens (Human)
Description:P00915
Residue:261
BDBM50381324
NameBDBM50381324
Synonyms:CHEMBL2019138
TypeSmall organic molecule
Emp. Form.C15H10ClNO2
Mol. Mass.271.698
SMILESNc1oc2cc(Cl)ccc2c(=O)c1-c1ccccc1