Reaction Details
TargetCarbonic anhydrase 1
LigandBDBM26664
Substrate/Competitorn/a
Meas. Tech.ChEMBL_814440 (CHEMBL2019836)
Ki 3370±n/a nM
Citation Balboni, GCongiu, COnnis, VMaresca, AScozzafava, AWinum, JYMaietti, ASupuran, CT Flavones and structurally related 4-chromenones inhibit carbonic anhydrases by a different mechanism of action compared to coumarins. Bioorg Med Chem Lett22:3063-6 (2012) 
 
Carbonic anhydrase 1
Name:Carbonic anhydrase 1
Type:Enzyme
Mol. Mass.:28873.37
Organism:Homo sapiens (Human)
Description:P00915
Residue:261
BDBM26664
NameBDBM26664
Synonyms:7-Hydroxy-flavone, 5a 7-hydroxy-2-phenyl-4H-chromen-4-one CHEMBL276915
TypeFlavonoid
Emp. Form.C15H10O3
Mol. Mass.238.2381
SMILESOc1ccc2c(c1)oc(cc2=O)-c1ccccc1