Reaction Details
TargetCarbonic anhydrase 1
LigandBDBM50381319
Substrate/Competitorn/a
Meas. Tech.ChEMBL_814440 (CHEMBL2019836)
IC50 9560±n/a nM
Citation Balboni, GCongiu, COnnis, VMaresca, AScozzafava, AWinum, JYMaietti, ASupuran, CT Flavones and structurally related 4-chromenones inhibit carbonic anhydrases by a different mechanism of action compared to coumarins. Bioorg Med Chem Lett22:3063-6 (2012) 
 
Carbonic anhydrase 1
Name:Carbonic anhydrase 1
Type:Enzyme
Mol. Mass.:28873.37
Organism:Homo sapiens (Human)
Description:P00915
Residue:261
BDBM50381319
NameBDBM50381319
Synonyms:CHEMBL2019143
TypeSmall organic molecule
Emp. Form.C16H12ClNO3
Mol. Mass.301.724
SMILESCOc1ccc(cc1)-c1c(N)oc2ccc(Cl)cc2c1=O