Reaction Details
TargetCarbonic anhydrase 1
LigandBDBM50381330
Substrate/Competitorn/a
Meas. Tech.ChEMBL_814440 (CHEMBL2019836)
IC50 7680±n/a nM
Citation Balboni, GCongiu, COnnis, VMaresca, AScozzafava, AWinum, JYMaietti, ASupuran, CT Flavones and structurally related 4-chromenones inhibit carbonic anhydrases by a different mechanism of action compared to coumarins. Bioorg Med Chem Lett22:3063-6 (2012) 
 
Carbonic anhydrase 1
Name:Carbonic anhydrase 1
Type:Enzyme
Mol. Mass.:28873.37
Organism:Homo sapiens (Human)
Description:P00915
Residue:261
BDBM50381330
NameBDBM50381330
Synonyms:CHEMBL2019146
TypeSmall organic molecule
Emp. Form.C17H14ClNO4
Mol. Mass.331.75
SMILESCOc1ccc(cc1OC)-c1c(N)oc2ccc(Cl)cc2c1=O