Reaction Details
TargetCarbonic anhydrase 1
LigandBDBM50381320
Substrate/Competitorn/a
Meas. Tech.ChEMBL_814440 (CHEMBL2019836)
IC50 9850±n/a nM
Citation Balboni, GCongiu, COnnis, VMaresca, AScozzafava, AWinum, JYMaietti, ASupuran, CT Flavones and structurally related 4-chromenones inhibit carbonic anhydrases by a different mechanism of action compared to coumarins. Bioorg Med Chem Lett22:3063-6 (2012) 
 
Carbonic anhydrase 1
Name:Carbonic anhydrase 1
Type:Enzyme
Mol. Mass.:28873.37
Organism:Homo sapiens (Human)
Description:P00915
Residue:261
BDBM50381320
NameBDBM50381320
Synonyms:CHEMBL2019148
TypeSmall organic molecule
Emp. Form.C16H13NO3
Mol. Mass.267.2793
SMILESCOc1ccc2c(c1)oc(N)c(-c1ccccc1)c2=O