Reaction Details
TargetMuscarinic acetylcholine receptor M3
LigandBDBM50381637
Substrate/Competitorn/a
Meas. Tech.ChEMBL_815843 (CHEMBL2026106)
IC50 89.6±n/a nM
Citation Lainé, DIYan, HXie, HDavis, RSDufour, JWiddowson, KLPalovich, MRWan, ZFoley, JJSchmidt, DBHunsberger, GEBurman, MBacon, AMWebb, EFLuttmann, MASalmon, MSarau, HMUmbrecht, STLandis, PSPeck, BJBusch-Petersen, J Design, synthesis and structure-activity relationship of N-substituted tropane muscarinic acetylcholine receptor antagonists. Bioorg Med Chem Lett22:3366-9 (2012) 
 
Muscarinic acetylcholine receptor M3
Name:Muscarinic acetylcholine receptor M3
Type:Enzyme
Mol. Mass.:66151.03
Organism:Homo sapiens (Human)
Description:P20309
Residue:590
BDBM50381637
NameBDBM50381637
Synonyms:CHEMBL2023754
TypeSmall organic molecule
Emp. Form.C30H39N2
Mol. Mass.427.6435
SMILESC[N+]1(CC2CCCCC2)C2CCC1C[C@@H](CC(C#N)(c1ccccc1)c1ccccc1)C2