Reaction Details
TargetMuscarinic acetylcholine receptor M3
LigandBDBM50381643
Substrate/Competitorn/a
Meas. Tech.ChEMBL_815843 (CHEMBL2026106)
IC50 64±n/a nM
Citation Lainé, DIYan, HXie, HDavis, RSDufour, JWiddowson, KLPalovich, MRWan, ZFoley, JJSchmidt, DBHunsberger, GEBurman, MBacon, AMWebb, EFLuttmann, MASalmon, MSarau, HMUmbrecht, STLandis, PSPeck, BJBusch-Petersen, J Design, synthesis and structure-activity relationship of N-substituted tropane muscarinic acetylcholine receptor antagonists. Bioorg Med Chem Lett22:3366-9 (2012) 
 
Muscarinic acetylcholine receptor M3
Name:Muscarinic acetylcholine receptor M3
Type:Enzyme
Mol. Mass.:66151.03
Organism:Homo sapiens (Human)
Description:P20309
Residue:590
BDBM50381643
NameBDBM50381643
Synonyms:CHEMBL2023759
TypeSmall organic molecule
Emp. Form.C35H51N2
Mol. Mass.499.7923
SMILESCCCCCCCCCCCC[N+]1(C)C2CCC1C[C@@H](CC(C#N)(c1ccccc1)c1ccccc1)C2