Reaction Details
TargetMuscarinic acetylcholine receptor M3
LigandBDBM50381650
Substrate/Competitorn/a
Meas. Tech.ChEMBL_815844 (CHEMBL2026107)
Kd 0.501±n/a nM
Citation Lainé, DIYan, HXie, HDavis, RSDufour, JWiddowson, KLPalovich, MRWan, ZFoley, JJSchmidt, DBHunsberger, GEBurman, MBacon, AMWebb, EFLuttmann, MASalmon, MSarau, HMUmbrecht, STLandis, PSPeck, BJBusch-Petersen, J Design, synthesis and structure-activity relationship of N-substituted tropane muscarinic acetylcholine receptor antagonists. Bioorg Med Chem Lett22:3366-9 (2012) 
 
Muscarinic acetylcholine receptor M3
Name:Muscarinic acetylcholine receptor M3
Type:Enzyme
Mol. Mass.:66151.03
Organism:Homo sapiens (Human)
Description:P20309
Residue:590
BDBM50381650
NameBDBM50381650
Synonyms:CHEMBL2023752
TypeSmall organic molecule
Emp. Form.C26H33N2O
Mol. Mass.389.5525
SMILESCOCC[N+]1(C)C2CCC1C[C@@H](CC(C#N)(c1ccccc1)c1ccccc1)C2