Reaction Details
TargetMuscarinic acetylcholine receptor M2
LigandBDBM50381654
Substrate/Competitorn/a
Meas. Tech.ChEMBL_815846 (CHEMBL2026109)
Ki 0.1±n/a nM
Citation Lainé, DIYan, HXie, HDavis, RSDufour, JWiddowson, KLPalovich, MRWan, ZFoley, JJSchmidt, DBHunsberger, GEBurman, MBacon, AMWebb, EFLuttmann, MASalmon, MSarau, HMUmbrecht, STLandis, PSPeck, BJBusch-Petersen, J Design, synthesis and structure-activity relationship of N-substituted tropane muscarinic acetylcholine receptor antagonists. Bioorg Med Chem Lett22:3366-9 (2012) 
 
Muscarinic acetylcholine receptor M2
Name:Muscarinic acetylcholine receptor M2
Type:GPCR
Mol. Mass.:51730.61
Organism:Homo sapiens (Human)
Description:P08172
Residue:466
BDBM50381654
NameBDBM50381654
Synonyms:CHEMBL2023764
TypeSmall organic molecule
Emp. Form.C29H37N2
Mol. Mass.413.6169
SMILESC[N@+]1(CCCCC=C)C2CCC1C[C@@H](CC(C#N)(c1ccccc1)c1ccccc1)C2