Reaction Details
TargetDelta-type opioid receptor
LigandBDBM50266337
Substrate/Competitorn/a
Meas. Tech.ChEMBL_816184 (CHEMBL2026568)
Ki>10000±n/a nM
Citation Lovell, KMVasiljevik, TAraya, JJLozama, APrevatt-Smith, KMDay, VWDersch, CMRothman, RBButelman, ERKreek, MJPrisinzano, TE Semisynthetic neoclerodanes as kappa opioid receptor probes. Bioorg Med Chem20:3100-10 (2012) 
 
Delta-type opioid receptor
Name:Delta-type opioid receptor
Type:G Protein-Coupled Receptor (GPCR)
Mol. Mass.:40382.98
Organism:Homo sapiens (Human)
Description:Competition binding assays were carried out using membrane preparations from transfected HN9.10 cells that constitutively expressed the delta opioid receptor.
Residue:372
BDBM50266337
NameBDBM50266337
Synonyms:12-epi-Salvinorin A | CHEMBL458235
TypeSmall organic molecule
Emp. Form.C23H28O8
Mol. Mass.432.4636
SMILESCOC(=O)[C@@H]1C[C@H](OC(C)=O)C(=O)[C@H]2[C@@]1(C)CC[C@H]1C(=O)O[C@H](C[C@]21C)c1ccoc1