Reaction Details
TargetAurora kinase B
LigandBDBM50201302
Substrate/Competitorn/a
Meas. Tech.ChEMBL_816379 (CHEMBL2024777)
IC50 3280±n/a nM
Citation Curtin, MLFrey, RRHeyman, HRSoni, NBMarcotte, PAPease, LJGlaser, KBMagoc, TJTapang, PAlbert, DHOsterling, DJOlson, AMBouska, JJGuan, ZPreusser, LCPolakowski, JSStewart, KDTse, CDavidsen, SKMichaelides, MR Thienopyridine ureas as dual inhibitors of the VEGF and Aurora kinase families. Bioorg Med Chem Lett22:3208-12 (2012) 
 
Aurora kinase B
Name:Aurora kinase B
Type:Protein
Mol. Mass.:39327.72
Organism:Homo sapiens (Human)
Description:Q96GD4
Residue:344
BDBM50201302
NameBDBM50201302
Synonyms:1-(4-(4-amino-7-phenylthieno[3,2-c]pyridin-3-yl)phenyl)-3-m-tolylurea | CHEMBL231511
TypeSmall organic molecule
Emp. Form.C27H22N4OS
Mol. Mass.450.555
SMILESCc1cccc(NC(=O)Nc2ccc(cc2)-c2csc3c(cnc(N)c23)-c2ccccc2)c1