Reaction Details
TargetAurora kinase B
LigandBDBM50381692
Substrate/Competitorn/a
Meas. Tech.ChEMBL_816379 (CHEMBL2024777)
IC50 11±n/a nM
Citation Curtin, MLFrey, RRHeyman, HRSoni, NBMarcotte, PAPease, LJGlaser, KBMagoc, TJTapang, PAlbert, DHOsterling, DJOlson, AMBouska, JJGuan, ZPreusser, LCPolakowski, JSStewart, KDTse, CDavidsen, SKMichaelides, MR Thienopyridine ureas as dual inhibitors of the VEGF and Aurora kinase families. Bioorg Med Chem Lett22:3208-12 (2012) 
 
Aurora kinase B
Name:Aurora kinase B
Type:Protein
Mol. Mass.:39327.72
Organism:Homo sapiens (Human)
Description:Q96GD4
Residue:344
BDBM50381692
NameBDBM50381692
Synonyms:CHEMBL1979883
TypeSmall organic molecule
Emp. Form.C26H25N5OS
Mol. Mass.455.575
SMILESCN(C)CC#Cc1cnc(N)c2c(csc12)-c1ccc(NC(=O)Nc2cccc(C)c2)cc1