Reaction Details
TargetAurora kinase B
LigandBDBM50381715
Substrate/Competitorn/a
Meas. Tech.ChEMBL_816379 (CHEMBL2024777)
IC50 5±n/a nM
Citation Curtin, MLFrey, RRHeyman, HRSoni, NBMarcotte, PAPease, LJGlaser, KBMagoc, TJTapang, PAlbert, DHOsterling, DJOlson, AMBouska, JJGuan, ZPreusser, LCPolakowski, JSStewart, KDTse, CDavidsen, SKMichaelides, MR Thienopyridine ureas as dual inhibitors of the VEGF and Aurora kinase families. Bioorg Med Chem Lett22:3208-12 (2012) 
 
Aurora kinase B
Name:Aurora kinase B
Type:Protein
Mol. Mass.:39327.72
Organism:Homo sapiens (Human)
Description:Q96GD4
Residue:344
BDBM50381715
NameBDBM50381715
Synonyms:CHEMBL2022855
TypeSmall organic molecule
Emp. Form.C28H24FN7O2S
Mol. Mass.541.599
SMILESCN1CCC(C1=O)n1cc(cn1)-c1cnc(N)c2c(csc12)-c1ccc(NC(=O)Nc2cccc(F)c2)cc1