Reaction Details
TargetAurora kinase B
LigandBDBM50381707
Substrate/Competitorn/a
Meas. Tech.ChEMBL_816379 (CHEMBL2024777)
IC50 114±n/a nM
Citation Curtin, MLFrey, RRHeyman, HRSoni, NBMarcotte, PAPease, LJGlaser, KBMagoc, TJTapang, PAlbert, DHOsterling, DJOlson, AMBouska, JJGuan, ZPreusser, LCPolakowski, JSStewart, KDTse, CDavidsen, SKMichaelides, MR Thienopyridine ureas as dual inhibitors of the VEGF and Aurora kinase families. Bioorg Med Chem Lett22:3208-12 (2012) 
 
Aurora kinase B
Name:Aurora kinase B
Type:Protein
Mol. Mass.:39327.72
Organism:Homo sapiens (Human)
Description:Q96GD4
Residue:344
BDBM50381707
NameBDBM50381707
Synonyms:CHEMBL2023231
TypeSmall organic molecule
Emp. Form.C25H22N6O2S
Mol. Mass.470.546
SMILESCOc1ccc(NC(=O)Nc2ccc(cc2)-c2csc3c(cnc(N)c23)-c2cnn(C)c2)cc1