Reaction Details
TargetVascular endothelial growth factor receptor 2
LigandBDBM50381696
Substrate/Competitorn/a
Meas. Tech.ChEMBL_816380 (CHEMBL2024778)
IC50 1±n/a nM
Citation Curtin, MLFrey, RRHeyman, HRSoni, NBMarcotte, PAPease, LJGlaser, KBMagoc, TJTapang, PAlbert, DHOsterling, DJOlson, AMBouska, JJGuan, ZPreusser, LCPolakowski, JSStewart, KDTse, CDavidsen, SKMichaelides, MR Thienopyridine ureas as dual inhibitors of the VEGF and Aurora kinase families. Bioorg Med Chem Lett22:3208-12 (2012) 
 
Vascular endothelial growth factor receptor 2
Name:Vascular endothelial growth factor receptor 2
Type:Receptor Tyrosine Kinase
Mol. Mass.:151510.97
Organism:Homo sapiens (Human)
Description:P35968
Residue:1356
BDBM50381696
NameBDBM50381696
Synonyms:CHEMBL2021941
TypeSmall organic molecule
Emp. Form.C25H21N5OS
Mol. Mass.439.532
SMILESCc1cccc(NC(=O)Nc2ccc(cc2)-c2csc3c(cnc(N)c23)-c2cc[nH]c2)c1