Reaction Details
TargetVascular endothelial growth factor receptor 2
LigandBDBM50381700
Substrate/Competitorn/a
Meas. Tech.ChEMBL_816380 (CHEMBL2024778)
IC50 6±n/a nM
Citation Curtin, MLFrey, RRHeyman, HRSoni, NBMarcotte, PAPease, LJGlaser, KBMagoc, TJTapang, PAlbert, DHOsterling, DJOlson, AMBouska, JJGuan, ZPreusser, LCPolakowski, JSStewart, KDTse, CDavidsen, SKMichaelides, MR Thienopyridine ureas as dual inhibitors of the VEGF and Aurora kinase families. Bioorg Med Chem Lett22:3208-12 (2012) 
 
Vascular endothelial growth factor receptor 2
Name:Vascular endothelial growth factor receptor 2
Type:Receptor Tyrosine Kinase
Mol. Mass.:151510.97
Organism:Homo sapiens (Human)
Description:P35968
Residue:1356
BDBM50381700
NameBDBM50381700
Synonyms:CHEMBL1982466
TypeSmall organic molecule
Emp. Form.C25H22N6OS
Mol. Mass.454.547
SMILESCc1ccc(NC(=O)Nc2ccc(cc2)-c2csc3c(cnc(N)c23)-c2cnn(C)c2)cc1