Reaction Details
TargetVascular endothelial growth factor receptor 2
LigandBDBM50381713
Substrate/Competitorn/a
Meas. Tech.ChEMBL_816380 (CHEMBL2024778)
IC50 1±n/a nM
Citation Curtin, MLFrey, RRHeyman, HRSoni, NBMarcotte, PAPease, LJGlaser, KBMagoc, TJTapang, PAlbert, DHOsterling, DJOlson, AMBouska, JJGuan, ZPreusser, LCPolakowski, JSStewart, KDTse, CDavidsen, SKMichaelides, MR Thienopyridine ureas as dual inhibitors of the VEGF and Aurora kinase families. Bioorg Med Chem Lett22:3208-12 (2012) 
 
Vascular endothelial growth factor receptor 2
Name:Vascular endothelial growth factor receptor 2
Type:Receptor Tyrosine Kinase
Mol. Mass.:151510.97
Organism:Homo sapiens (Human)
Description:P35968
Residue:1356
BDBM50381713
NameBDBM50381713
Synonyms:CHEMBL2022853
TypeSmall organic molecule
Emp. Form.C26H23FN6O3S2
Mol. Mass.550.628
SMILESCS(=O)(=O)CCn1cc(cn1)-c1cnc(N)c2c(csc12)-c1ccc(NC(=O)Nc2cccc(F)c2)cc1