Reaction Details
TargetPotassium voltage-gated channel subfamily H member 2
LigandBDBM50381716
Substrate/Competitorn/a
Meas. Tech.ChEMBL_816393 (CHEMBL2024791)
IC50 1000±n/a nM
Citation Curtin, MLFrey, RRHeyman, HRSoni, NBMarcotte, PAPease, LJGlaser, KBMagoc, TJTapang, PAlbert, DHOsterling, DJOlson, AMBouska, JJGuan, ZPreusser, LCPolakowski, JSStewart, KDTse, CDavidsen, SKMichaelides, MR Thienopyridine ureas as dual inhibitors of the VEGF and Aurora kinase families. Bioorg Med Chem Lett22:3208-12 (2012) 
 
Potassium voltage-gated channel subfamily H member 2
Name:Potassium voltage-gated channel subfamily H member 2
Type:Multi-pass membrane protein
Mol. Mass.:126672.65
Organism:Homo sapiens (Human)
Description:Q12809
Residue:1159
BDBM50381716
NameBDBM50381716
Synonyms:ABT-348 US8722890, 1 | US8722890, 2
TypeSmall organic molecule
Emp. Form.C25H21FN6O2S
Mol. Mass.488.537
SMILESNc1ncc(-c2cnn(CCO)c2)c2scc(-c3ccc(NC(=O)Nc4cccc(F)c4)cc3)c12