Reaction Details
TargetTyrosine-protein kinase Fyn
LigandBDBM50381716
Substrate/Competitorn/a
Meas. Tech.ChEMBL_816417 (CHEMBL2024904)
IC50 110±n/a nM
Citation Curtin, MLFrey, RRHeyman, HRSoni, NBMarcotte, PAPease, LJGlaser, KBMagoc, TJTapang, PAlbert, DHOsterling, DJOlson, AMBouska, JJGuan, ZPreusser, LCPolakowski, JSStewart, KDTse, CDavidsen, SKMichaelides, MR Thienopyridine ureas as dual inhibitors of the VEGF and Aurora kinase families. Bioorg Med Chem Lett22:3208-12 (2012) 
 
Tyrosine-protein kinase Fyn
Name:Tyrosine-protein kinase Fyn
Type:Enzyme
Mol. Mass.:60762.21
Organism:Homo sapiens (Human)
Description:P06241
Residue:537
BDBM50381716
NameBDBM50381716
Synonyms:ABT-348 US8722890, 1 | US8722890, 2
TypeSmall organic molecule
Emp. Form.C25H21FN6O2S
Mol. Mass.488.537
SMILESNc1ncc(-c2cnn(CCO)c2)c2scc(-c3ccc(NC(=O)Nc4cccc(F)c4)cc3)c12