Reaction Details
TargetDipeptidyl peptidase 4
LigandBDBM50381855
Substrate/Competitorn/a
Meas. Tech.ChEMBL_816818 (CHEMBL2026010)
IC50 2.34±n/a nM
Citation Xie, HZeng, LZeng, SLu, XZhang, GZhao, XCheng, NTu, ZLi, ZXu, HYang, LZhang, XHuang, MZhao, JHu, W Novel pyrrolopyrimidine analogues as potent dipeptidyl peptidase IV inhibitors based on pharmacokinetic property-driven optimization. Eur J Med Chem52:205-12 (2012) 
 
Dipeptidyl peptidase 4
Name:Dipeptidyl peptidase 4
Type:Enzyme
Mol. Mass.:88271.01
Organism:Homo sapiens (Human)
Description:P27487
Residue:766
BDBM50381855
NameBDBM50381855
Synonyms:CHEMBL2023066
TypeSmall organic molecule
Emp. Form.C24H23N7O
Mol. Mass.425.4857
SMILESN[C@@H]1CCCN(C1)c1nc2[nH]c(cc2c(=O)n1Cc1ccccc1C#N)-c1cccnc1