Reaction Details
TargetCannabinoid receptor 2
LigandBDBM50381874
Substrate/Competitorn/a
Meas. Tech.ChEMBL_817534 (CHEMBL2027757)
Ki 7900±n/a nM
Citation Manera, CSaccomanni, GMalfitano, AMBertini, SCastelli, FLaezza, CLigresti, ALucchesi, VTuccinardi, TRizzolio, FBifulco, MDi Marzo, VGiordano, AMacchia, MMartinelli, A Rational design, synthesis and anti-proliferative properties of new CB2 selective cannabinoid receptor ligands: an investigation of the 1,8-naphthyridin-2(1H)-one scaffold. Eur J Med Chem52:284-94 (2012) 
 
Cannabinoid receptor 2
Name:Cannabinoid receptor 2
Type:G Protein-Coupled Receptor (GPCR)
Mol. Mass.:39690.94
Organism:Homo sapiens (Human)
Description:P34972
Residue:360
BDBM50381874
NameBDBM50381874
Synonyms:CHEMBL2022697
TypeSmall organic molecule
Emp. Form.C18H27N3O3
Mol. Mass.333.4253
SMILESO=C(NC1CCCCC1)c1cccn(CCN2CCOCC2)c1=O