Reaction Details
TargetCannabinoid receptor 2
LigandBDBM50381881
Substrate/Competitorn/a
Meas. Tech.ChEMBL_817534 (CHEMBL2027757)
Ki 200±n/a nM
Citation Manera, CSaccomanni, GMalfitano, AMBertini, SCastelli, FLaezza, CLigresti, ALucchesi, VTuccinardi, TRizzolio, FBifulco, MDi Marzo, VGiordano, AMacchia, MMartinelli, A Rational design, synthesis and anti-proliferative properties of new CB2 selective cannabinoid receptor ligands: an investigation of the 1,8-naphthyridin-2(1H)-one scaffold. Eur J Med Chem52:284-94 (2012) 
 
Cannabinoid receptor 2
Name:Cannabinoid receptor 2
Type:G Protein-Coupled Receptor (GPCR)
Mol. Mass.:39690.94
Organism:Homo sapiens (Human)
Description:P34972
Residue:360
BDBM50381881
NameBDBM50381881
Synonyms:CHEMBL2022695
TypeSmall organic molecule
Emp. Form.C19H22N2O2
Mol. Mass.310.3902
SMILESO=C(NC1CCCCC1)c1cccn(Cc2ccccc2)c1=O