Reaction Details
TargetBombesin receptor subtype-3
LigandBDBM50381918
Substrate/Competitorn/a
Meas. Tech.ChEMBL_817747 (CHEMBL2027395)
IC50 0.5±n/a nM
Citation Chobanian, HRGuo, YLiu, PLanza, TJChioda, MChang, LKelly, TMKan, YPalyha, OGuan, XMMarsh, DJMetzger, JMRaustad, KWang, SPStrack, AMGorski, JNMiller, RPang, JLyons, KDragovic, JNing, JGSchafer, WAWelch, CJGong, XGao, YDHornak, VReitman, MLNargund, RPLin, LS The design and synthesis of potent, selective benzodiazepine sulfonamide bombesin receptor subtype 3 (BRS-3) agonists with an increased barrier of atropisomerization. Bioorg Med Chem20:2845-9 (2012) 
 
Bombesin receptor subtype-3
Name:Bombesin receptor subtype-3
Type:Enzyme Catalytic Domain
Mol. Mass.:44424.45
Organism:Homo sapiens (Human)
Description:Bombesin 3 BRS3 HUMAN::P32247
Residue:399
BDBM50381918
NameBDBM50381918
Synonyms:CHEMBL2023113
TypeSmall organic molecule
Emp. Form.C25H20F6N4O4S
Mol. Mass.586.506
SMILESNC(=O)C1(CCC1)c1cccc2Nc3nc(ccc3CN(c12)S(=O)(=O)c1ccc(OC(F)(F)F)cc1)C(F)(F)F