Reaction Details
TargetReceptor-type tyrosine-protein kinase FLT3
LigandBDBM50381924
Substrate/Competitorn/a
Meas. Tech.ChEMBL_814803 (CHEMBL2026428)
IC50>1000±n/a nM
Citation Plé, PAJung, FAshton, SHennequin, LLaine, RLambert-van der Brempt, CMorgentin, RPasquet, GTaylor, S Discovery of new quinoline ether inhibitors with high affinity and selectivity for PDGFR tyrosine kinases. Bioorg Med Chem Lett22:3050-5 (2012) 
 
Receptor-type tyrosine-protein kinase FLT3
Name:Receptor-type tyrosine-protein kinase FLT3
Type:Enzyme
Mol. Mass.:112888.62
Organism:Homo sapiens (Human)
Description:P36888
Residue:993
BDBM50381924
NameBDBM50381924
Synonyms:CHEMBL2023484
TypeSmall organic molecule
Emp. Form.C24H24N4O4
Mol. Mass.432.4718
SMILESCCc1cn[nH]c1NC(=O)Cc1ccc(Oc2ccnc3cc(OC)ccc23)cc1OC