Reaction Details
TargetReceptor-type tyrosine-protein kinase FLT3
LigandBDBM50381944
Substrate/Competitorn/a
Meas. Tech.ChEMBL_814803 (CHEMBL2026428)
IC50>1000±n/a nM
Citation Plé, PAJung, FAshton, SHennequin, LLaine, RLambert-van der Brempt, CMorgentin, RPasquet, GTaylor, S Discovery of new quinoline ether inhibitors with high affinity and selectivity for PDGFR tyrosine kinases. Bioorg Med Chem Lett22:3050-5 (2012) 
 
Receptor-type tyrosine-protein kinase FLT3
Name:Receptor-type tyrosine-protein kinase FLT3
Type:Enzyme
Mol. Mass.:112888.62
Organism:Homo sapiens (Human)
Description:P36888
Residue:993
BDBM50381944
NameBDBM50381944
Synonyms:CHEMBL2023801
TypeSmall organic molecule
Emp. Form.C25H27N5O5
Mol. Mass.477.5124
SMILESCCc1n[nH]c(NC(=O)Cc2ncc(Oc3ccnc4cc(OC)c(OC)cc34)cc2OC)c1C