Reaction Details
TargetVascular endothelial growth factor receptor 2
LigandBDBM50381937
Substrate/Competitorn/a
Meas. Tech.ChEMBL_817758 (CHEMBL2027406)
IC50>10000±n/a nM
Citation Plé, PAJung, FAshton, SHennequin, LLaine, RLambert-van der Brempt, CMorgentin, RPasquet, GTaylor, S Discovery of new quinoline ether inhibitors with high affinity and selectivity for PDGFR tyrosine kinases. Bioorg Med Chem Lett22:3050-5 (2012) 
 
Vascular endothelial growth factor receptor 2
Name:Vascular endothelial growth factor receptor 2
Type:Receptor Tyrosine Kinase
Mol. Mass.:151510.97
Organism:Homo sapiens (Human)
Description:P35968
Residue:1356
BDBM50381937
NameBDBM50381937
Synonyms:CHEMBL2023479
TypeSmall organic molecule
Emp. Form.C24H23N3O5
Mol. Mass.433.4565
SMILESCOc1ccc2nccc(Oc3ccc(CC(=O)Nc4noc(C)c4C)c(OC)c3)c2c1