Reaction Details
TargetVascular endothelial growth factor receptor 2
LigandBDBM50381928
Substrate/Competitorn/a
Meas. Tech.ChEMBL_817758 (CHEMBL2027406)
IC50 4819±n/a nM
Citation Plé, PAJung, FAshton, SHennequin, LLaine, RLambert-van der Brempt, CMorgentin, RPasquet, GTaylor, S Discovery of new quinoline ether inhibitors with high affinity and selectivity for PDGFR tyrosine kinases. Bioorg Med Chem Lett22:3050-5 (2012) 
 
Vascular endothelial growth factor receptor 2
Name:Vascular endothelial growth factor receptor 2
Type:Receptor Tyrosine Kinase
Mol. Mass.:151510.97
Organism:Homo sapiens (Human)
Description:P35968
Residue:1356
BDBM50381928
NameBDBM50381928
Synonyms:CHEMBL2023802
TypeSmall organic molecule
Emp. Form.C26H29N5O5
Mol. Mass.491.539
SMILESCCOc1cc2nccc(Oc3cnc(CC(=O)Nc4[nH]nc(CC)c4C)c(OC)c3)c2cc1OC