Reaction Details
TargetCytochrome P450 2D6
LigandBDBM50381928
Substrate/Competitorn/a
Meas. Tech.ChEMBL_814824 (CHEMBL2026449)
IC50>8600±n/a nM
Citation Plé, PAJung, FAshton, SHennequin, LLaine, RLambert-van der Brempt, CMorgentin, RPasquet, GTaylor, S Discovery of new quinoline ether inhibitors with high affinity and selectivity for PDGFR tyrosine kinases. Bioorg Med Chem Lett22:3050-5 (2012) 
 
Cytochrome P450 2D6
Name:Cytochrome P450 2D6
Type:Protein
Mol. Mass.:55774.82
Organism:Homo sapiens (Human)
Description:P10635
Residue:497
BDBM50381928
NameBDBM50381928
Synonyms:CHEMBL2023802
TypeSmall organic molecule
Emp. Form.C26H29N5O5
Mol. Mass.491.539
SMILESCCOc1cc2nccc(Oc3cnc(CC(=O)Nc4[nH]nc(CC)c4C)c(OC)c3)c2cc1OC