Reaction Details
TargetPlatelet-derived growth factor receptor beta
LigandBDBM50362058
Substrate/Competitorn/a
Meas. Tech.ChEMBL_817757 (CHEMBL2027405)
IC50 4±n/a nM
Citation Plé, PAJung, FAshton, SHennequin, LLaine, RLambert-van der Brempt, CMorgentin, RPasquet, GTaylor, S Discovery of new quinoline ether inhibitors with high affinity and selectivity for PDGFR tyrosine kinases. Bioorg Med Chem Lett22:3050-5 (2012) 
 
Platelet-derived growth factor receptor beta
Name:Platelet-derived growth factor receptor beta
Type:Enzyme
Mol. Mass.:123922.25
Organism:Homo sapiens (Human)
Description:P09619
Residue:1106
BDBM50362058
NameBDBM50362058
Synonyms:CHEMBL1940274
TypeSmall organic molecule
Emp. Form.C24H25N5O4
Mol. Mass.447.4864
SMILESCOc1cc2ncnc(Oc3ccc(CC(=O)Nc4cnn(c4)C(C)C)cc3)c2cc1OC