Reaction Details
TargetSerine/threonine-protein kinase Chk1
LigandBDBM50335179
Substrate/Competitorn/a
Meas. Tech.ChEMBL_815114 (CHEMBL2024839)
IC50 20±n/a nM
Citation Voss, MERainka, MPFleming, MPeterson, LHBelanger, DBSiddiqui, MAHruza, AVoigt, JGray, KBasso, AD Synthesis and SAR studies of imidazo-[1,2-a]-pyrazine Aurora kinase inhibitors with improved off-target kinase selectivity. Bioorg Med Chem Lett22:3544-9 (2012) 
 
Serine/threonine-protein kinase Chk1
Name:Serine/threonine-protein kinase Chk1
Type:Enzyme Catalytic Domain
Mol. Mass.:54443.02
Organism:Homo sapiens (Human)
Description:gi_166295192
Residue:476
BDBM50335179
NameBDBM50335179
Synonyms:6-Methyl-N-[3-(1-piperidinylmethyl)-5-isothiazolyl]-3-(1Hpyrazol-4-yl)imidazo[1,2-a]pyrazin-8-amine Hydrochloride CHEMBL1739550
TypeSmall organic molecule
Emp. Form.C19H22N8S
Mol. Mass.394.497
SMILESCc1cn2c(cnc2c(Nc2cc(CN3CCCCC3)ns2)n1)-c1cn[nH]c1