Reaction Details
TargetSerine/threonine-protein kinase Chk1
LigandBDBM50381995
Substrate/Competitorn/a
Meas. Tech.ChEMBL_815114 (CHEMBL2024839)
IC50 300±n/a nM
Citation Voss, MERainka, MPFleming, MPeterson, LHBelanger, DBSiddiqui, MAHruza, AVoigt, JGray, KBasso, AD Synthesis and SAR studies of imidazo-[1,2-a]-pyrazine Aurora kinase inhibitors with improved off-target kinase selectivity. Bioorg Med Chem Lett22:3544-9 (2012) 
 
Serine/threonine-protein kinase Chk1
Name:Serine/threonine-protein kinase Chk1
Type:Enzyme Catalytic Domain
Mol. Mass.:54443.02
Organism:Homo sapiens (Human)
Description:gi_166295192
Residue:476
BDBM50381995
NameBDBM50381995
Synonyms:CHEMBL2022369
TypeSmall organic molecule
Emp. Form.C27H31N9OS2
Mol. Mass.561.725
SMILESCC1CCCN(Cc2cc(Nc3nc(C)cn4c(cnc34)-c3cnn(CC(=O)NCc4cccs4)c3)sn2)C1