Reaction Details
TargetAurora kinase B
LigandBDBM50382028
Substrate/Competitorn/a
Meas. Tech.ChEMBL_815110 (CHEMBL2024835)
IC50 155±n/a nM
Citation Voss, MERainka, MPFleming, MPeterson, LHBelanger, DBSiddiqui, MAHruza, AVoigt, JGray, KBasso, AD Synthesis and SAR studies of imidazo-[1,2-a]-pyrazine Aurora kinase inhibitors with improved off-target kinase selectivity. Bioorg Med Chem Lett22:3544-9 (2012) 
 
Aurora kinase B
Name:Aurora kinase B
Type:Protein
Mol. Mass.:39327.72
Organism:Homo sapiens (Human)
Description:Q96GD4
Residue:344
BDBM50382028
NameBDBM50382028
Synonyms:CHEMBL2023300
TypeSmall organic molecule
Emp. Form.C31H38N10OS
Mol. Mass.598.765
SMILESCC1CCCN(Cc2cc(Nc3nc(C)cn4c(cnc34)-c3cnn(CC(=O)NCc4cccc(c4)N(C)C)c3)sn2)C1