Reaction Details
TargetAurora kinase A
LigandBDBM50381991
Substrate/Competitorn/a
Meas. Tech.ChEMBL_815109 (CHEMBL2024834)
IC50 168±n/a nM
Citation Voss, MERainka, MPFleming, MPeterson, LHBelanger, DBSiddiqui, MAHruza, AVoigt, JGray, KBasso, AD Synthesis and SAR studies of imidazo-[1,2-a]-pyrazine Aurora kinase inhibitors with improved off-target kinase selectivity. Bioorg Med Chem Lett22:3544-9 (2012) 
 
Aurora kinase A
Name:Aurora kinase A
Type:Serine/threonine-protein kinase
Mol. Mass.:45830.98
Organism:Homo sapiens (Human)
Description:O14965
Residue:403
BDBM50381991
NameBDBM50381991
Synonyms:CHEMBL2022367
TypeSmall organic molecule
Emp. Form.C26H30N10O2S
Mol. Mass.546.647
SMILESCC1CCCN(Cc2cc(Nc3nc(C)cn4c(cnc34)-c3cnn(CC(=O)NCc4ncco4)c3)sn2)C1