Reaction Details
TargetVascular endothelial growth factor receptor 2
LigandBDBM50381995
Substrate/Competitorn/a
Meas. Tech.ChEMBL_815112 (CHEMBL2024837)
IC50 234±n/a nM
Citation Voss, MERainka, MPFleming, MPeterson, LHBelanger, DBSiddiqui, MAHruza, AVoigt, JGray, KBasso, AD Synthesis and SAR studies of imidazo-[1,2-a]-pyrazine Aurora kinase inhibitors with improved off-target kinase selectivity. Bioorg Med Chem Lett22:3544-9 (2012) 
 
Vascular endothelial growth factor receptor 2
Name:Vascular endothelial growth factor receptor 2
Type:Receptor Tyrosine Kinase
Mol. Mass.:151510.97
Organism:Homo sapiens (Human)
Description:P35968
Residue:1356
BDBM50381995
NameBDBM50381995
Synonyms:CHEMBL2022369
TypeSmall organic molecule
Emp. Form.C27H31N9OS2
Mol. Mass.561.725
SMILESCC1CCCN(Cc2cc(Nc3nc(C)cn4c(cnc34)-c3cnn(CC(=O)NCc4cccs4)c3)sn2)C1